{"text_format":"1","workbook":"xlsx","n_sheets":4,"sheets":["ESSER TI Equitable Services","dataDistrictList","Dropdowns","DataLookupValues"],"not_rendered":{"charts":0,"images":0,"macros":1,"external_links":1,"defined_names":27,"comments":0,"pivot_tables":0},"unopened":[],"bounds":{"document_bytes":16777216,"sheet_cells":100000,"rows_first":2000,"rows_last":500,"rows_between":2000,"halvings":0,"cell_chars":16384,"cell_head_chars":4096},"cells_cut":0,"cells_raw":0,"read":"whole","date_system":"1900"}

{"sheet":"ESSER TI Equitable Services","index":0,"n_rows":130,"n_cols":9,"rows_kept":130,"cut":false,"hidden":false,"merged":[[15,2,15,3],[1,2,3,7],[5,2,6,7],[8,1,10,1],[8,2,10,2],[12,1,14,1],[12,2,12,4],[13,2,13,3],[14,2,14,3],[16,2,16,3],[19,2,19,3],[20,2,20,4],[23,1,24,1],[23,2,23,8]]}
[]
[null,null,"ESSER Equitable Services Reservation Calculator:\nTitle I Methodology (ESSA §1117)\nSeptember, 2020"]
[]
[]
[null,null," "]
[null,null,"Directions:\n  1.    Choose your district in Step 1.\n  2.    Review information that is autopopulated in Step 2.  Note that the total of low income students attending Title I schools in the district is\n         based on your FY20 grant application and may have included the 1.6 multiplier.  If your district's Title I application in the FY21 ESSA workbook\n         has been approved, you may elect to enter the total low-income enrollment from your Title I schools for FY21 (ESSA workbook, Tab 8, \n         Column 6) by contacting your grant liaison to discuss and unlock the yellow cell.  If your district uses the FY20 low income count provided, leave \n         this cell blank. \n  3.    Districts that are participating in ESSER as a Schedule A consortium will need to complete this calculator for each member district (including\n         the lead district) with eligible private schools and total the equitable services reservation.  The total of all member districts' equitable \n         services reservations will be budgeted on the lead district's ESSER budget.\n  4.    In Step 3, list all nonprofit private schools that, in FY20, had enrolled student(s) residing in an FY20 Title I attendance area in your district (or a FY21 Title I \n         attendance area if you are using district Title I low-income numbers from your FY21 application after contacting your liaison in Step 2) and indicate the city \n         or town where the private school is located and whether each intends to participate in equitable services for ESSER.  This list will include private schools\n         inside and outside of your district, the same as the method for calculating Title I.  It may be helpful to refer to the Equitable Services Tab in your FY20 or\n         FY21 ESSA application workbook for the list of eligible private schools, depending on the year you are using, but remember that eligible private schools \n         may participate in ESSER equitable services even if they have not participated in Title I.  Note that private schools that were not in existence as of\n         March 13,2020 are not eligible for equitable services.\n  5.   In Step 3, Column A, list the number of students in each private school who lived in an FY20 Title I attendance area in your district, if you are using FY20\n         district low-income data, or in FY21, if you are using FY21 district low-income data in Step 2. In Column B, list those students from Column A who are \n         low-income.  The low-income count (methodology and obtaining data) will be part of consultation with private school officials and may result in in a \n         similar method to that used by the district (i.e., applying the 1.6 multiplier to the private school low-income number if used by the district). Note that \n         districts have the option of using one of five methods for determining low-income counts of eligible private school students, including proportionality    \n        (the same % of low-income as the district Title I school in which the private school students reside).  See USED's non-regulatory guidance, especially \n        questions B-11 through B-13 \n        for details.\n  6.   Review the equitable services reservations and total available to the district that are generated in Step 2 after completing Columns A and \n         B for Step 3.  Amend your budget as necessary to reflect the revised reservation for private schools and amount available for district expenses. Attach \n         this completed calculator when amending  your FY20-FY21 ESSER application.  Please retain the name of the file (ESSERT1.leacode.xlsm), replacing     \n        \"leacode\" with your district's four-digit code.\n\n  IMPORTANT NOTES FOR DISTRICTS RE: USING ESSER FUNDS\n  •    Districts are no longer required to limit spending of ESSER funds to their Title I schools when calculating equitable services based on \n        private schools' low-income students.  \n  •   In addition, there are no supplement not-supplant-restrictions governing ESSER funds, nor does spending of ESSER funds for expenditures\n       in Title I schools violate Title I's supplement-not-supplant requirements."]
[]
[]
[null,"Step 1\nChoose District","Choose your district:"]
[]
[]
[]
[null,"Step 2\nCheck District Data","Allocation Reserved for Equitable Services Based on Low-Income Private School Students Residing in District Title I Attendance Areas"]
[null,null,"A. Total FY20/21 ESSER Allocation",null,{"$f":"IF(DataLookupValues!B7=\"OrgName\", \"\", valESSERAlloc)","v":""}]
[null,null,"B. 1) Total Low-Income Enrollment in District Title I Schools (FY20)  or",null,{"$f":"IF(DataLookupValues!B7=\"OrgName\", \"\", DistLowInc)","v":""}]
[null,null,"     2) Total Low-Income Enrollment in District Title I Schools from an approved FY21 ESSA application"]
[null,null,"C. Total Low-Income students residing in Title I attendance areas in participating private schools",null,{"$f":"countPSLowInc","v":0}]
[null,null,"D. Equitable Service Reservation per low-income student (private/district) (A/(B+C))",null,{"$f":"IFERROR(IF(E17=0, 0, E14/(IF(E16>0, E16, E15)+E17)), \"\")","v":0}]
[null,null,"E. Total ESSER Reservation for Equitable Services, Option 1B (C*D)",null,{"$f":"IFERROR(E18*E17, \"\")","v":0}]
[null,null,"F.  Total available for district's ESSER allowable expenditures ",null,{"$f":"IFERROR(E14-valResOpt1B, 0)","v":0}]
[null,null,"     (Amount per school is generated below in Step 3)"]
[]
[]
[null,"Step 3\nList Private Schools ","Private Schools Serving Eligible Children Residing In or Out of District and Reservations"]
[null,null,"\nList private schools located within or outside district boundaries that have enrolled students who reside in a \nTitle I-served school attendance area \n(Use FY20 or FY21 data, see Directions, above, par. 4)\n   ","Where is this private school located? \n(provide city or town)","Will this Private School participate in ESSER Fund Services?\n(Select Yes or No for each listed school)","Number of children enrolled in private school who reside in a Title I-served attendance area, grades K-12 \n(see Directions, par. 5)","Number of children from Column A who are low-income \n(see Directions, par. 5)","Amount Per Student for ESSER Services ","Allocation Per School for ESSER Fund Services\n"]
[null,null,".",null,null,"A","B","C","D"]
[null,null,null,null,"Select One",null,null,{"$f":"IFERROR(IF(E27=\"Yes\", TitleIPP, 0), \"\")","v":0},{"$f":"IFERROR(IF(E27=\"Yes\", G27*H27, 0), \"\")","v":0}]
[null,null,null,null,"Select One",null,null,0,{"$f":"IFERROR(IF(E28=\"Yes\", G28*H28, 0), \"\")","v":0}]
[null,null,null,null,"Select One",null,null,0,0]
[null,null,null,null,"Select One",null,null,0,0]
[null,null,null,null,"Select One",null,null,0,0]
[null,null,null,null,"Select One",null,null,0,0]
[null,null,null,null,"Select One",null,null,0,0]
[null,null,null,null,"Select One",null,null,0,0]
[null,null,null,null,"Select One",null,null,0,0]
[null,null,null,null,"Select One",null,null,0,0]
[null,null,null,null,"Select One",null,null,0,0]
[null,null,null,null,"Select One",null,null,0,0]
[null,null,null,null,"Select One",null,null,0,0]
[null,null,null,null,"Select One",null,null,0,0]
{"$rows_left_out":91}
{"sheet":"dataDistrictList","index":1,"n_rows":402,"n_cols":25,"rows_kept":402,"cut":false,"hidden":true,"merged":[]}
[1,"DISTRICT","OrgName","Org Type","Function","Contact Name","ADDR 1","ADDR 2","City","State","Zip","Liaison's Name","Liaison's Number","Liaison's Email",null,"March 2019 nElCOUNT_sum",null,"HOMELESS, K-12","SLE Gaps?","FY20 T1 Distr LowInc","March2020Enrolled","Schedule A?","Total T1FY20 ES Res","Total T1 Adjusted Alloc","ESSER Fund Allocation"]
[2,"04450000","Abby Kelley Foster Charter Public (District)","Charter District","Charter School Leader","Brian Haas","10 New Bond Street","","Worcester","MA","01606","Colleen Holforty","781-338-3522","colleen.e.holforty@mass.gov",null,140,null,13,"No","837",1425,null,0,457815,376583]
[3,"00010000","Abington","Public School District","Superintendent","Peter Schafer","1071 Washington St.","","Abington","MA","02351","Alex Lilley","781-338-6212","alex.j.lilley@mass.gov",null,100,null,6,"Yes","154",2073,null,0,198095,162946]
[4,"04120000","Academy Of the Pacific Rim Charter Public (District)","Charter District","Charter School Leader","Spencer Blasdale","1 Westinghouse Plaza Bldg B","","Hyde Park","MA","02136","Colleen Holforty","781-338-3522","colleen.e.holforty@mass.gov",null,68,null,3,"No","314",538,null,0,277352,228140]
[5,"06000000","Acton-Boxborough","Public School District","Superintendent","Peter Light","15 Charter Rd","","Acton","MA","01720","Sue Mazzarella","781-338-3587","susan.mazzarella@mass.gov",null,243,null,12,"Yes","127",5404,null,0,139279,114566]
[6,"00030000","Acushnet","Public School District","Superintendent","Paula Bailey","708 Middle Road","Suite 1","Acushnet","MA","02743","Colleen Holforty","781-338-3522","colleen.e.holforty@mass.gov",null,10,null,8,"Yes","192",970,null,1925.5714,94476,77713]
[7,"06030000","Adams-Cheshire","Public School District","Superintendent","Aaron Dean","191 Church St","","Cheshire","MA","01225","Alex Lilley","781-338-6212","alex.j.lilley@mass.gov",null,8,null,16,"Yes","619",1060,null,3607.8625999999999,322966,265661]
[8,"04300000","Advanced Math and Science Academy Charter (District)","Charter District","Charter School Leader","Ellen Linzey","201 Forest Street","","Marlborough","MA","01752","Sue Mazzarella","781-338-3587","susan.mazzarella@mass.gov",null,42,null,0,"Yes","101",965,null,0,20991,20000]
[9,"00050000","Agawam","Public School District","Superintendent","Steven Lemanski","1305 Springfield St","Suite 1","Feeding Hills","MA","01030","Nancy Labrie","781-338-3536","nancy.h.labrie@mass.gov",null,185,null,0,"Yes","685",3540,null,0,637360,524271]
[10,"04090000","Alma del Mar Charter School (District)","Charter District","Charter School Leader","Will Gardner","515 Belleville Ave","","New Bedford","MA","02746","Alex Chiu","781-338-3586","alexandria.w.chiu@mass.gov",null,106,null,0,"No","435",644,null,0,328799,270459]
[11,"00070000","Amesbury","Public School District","Superintendent","Jared Fulgoni","5 Highland Street","","Amesbury","MA","01913","Russ Fleming","781-338-6259","russellw.fleming@mass.gov",null,31,null,43,"Yes","308",1985,null,0,264458,217534]
[12,"00080000","Amherst","Public School District","Superintendent","Michael Morris","170 Chestnut Street","","Amherst","MA","01002","Ellie Rounds-Bloom","781-338-3128","eleanor.rounds@mass.gov",null,170,null,39,"Yes","700",1062,null,0,226198,186063]
[13,"06050000","Amherst-Pelham","Public School District","Superintendent","Michael Morris","170 Chestnut Street","","Amherst","MA","01002","Ellie Rounds-Bloom","781-338-3128","eleanor.rounds@mass.gov",null,84,null,0,"Yes","0",1330,null,0,280468,230703]
[14,"00090000","Andover","Public School District","Superintendent","Sheldon Berman","36 Bartlet Street","","Andover","MA","01810","Beth O'Connell","781-338-3132","elizabeth.a.o'connell@mass.gov",null,231,null,9,"Yes","466",5806,null,20232.821500000002,192632,158453]
[15,"35090000","Argosy Collegiate Charter School (District)","Charter District","Charter School Leader","Kristen Pavao","263 Hamlet Street","","Fall River","MA","02724","Julia Foodman","781-338-3577","julia.b.foodman@mass.gov",null,138,null,0,"No","408",500,null,0,269940,222043]
[16,"00100000","Arlington","Public School District","Superintendent","Kathleen Bodie","869 Massachusetts Avenue","","Arlington","MA","02476","Julia Foodman","781-338-3577","julia.b.foodman@mass.gov",null,275,null,10,"Yes","223",6029,null,0,187517,154245]
[17,"06100000","Ashburnham-Westminster","Public School District","Superintendent","Sandra Rehler","11 Oakmont Drive","","Ashburnham","MA","01430","Colleen Holforty","781-338-3522","colleen.e.holforty@mass.gov",null,32,null,6,"Yes","133",2323,null,0,153272,126076]
[18,"00140000","Ashland","Public School District","Superintendent","James Adams","87 West Union Street","","Ashland","MA","01721","Alex Lilley","781-338-6212","alex.j.lilley@mass.gov",null,162,null,14,"Yes","443",2802,null,0,195614,160905]
[19,"08010000","Assabet Valley Regional Vocational Technical","Public School District","Superintendent","Ernest Houle","215 Fitchburg Street","","Marlborough","MA","01752","Ellie Rounds-Bloom","781-338-3128","eleanor.rounds@mass.gov",null,33,null,0,"Yes","0",1123,null,0,156805,128982]
[20,"06150000","Athol-Royalston","Public School District","Superintendent","Darcy Fernandes","1062 Pleasant Street","","Athol","MA","01331","Nancy Labrie","781-338-3536","nancy.h.labrie@mass.gov",null,26,null,0,"Yes","1082",1468,null,0,534741,439859]
[21,"04910000","Atlantis Charter (District)","Charter District","Charter School Leader","Robert Beatty","991 Jefferson St","","Fall River","MA","02721","Alex Chiu","781-338-3586","alexandria.w.chiu@mass.gov",null,140,null,9,"Yes","866",1304,null,0,469689,386350]
[22,"00160000","Attleboro","Public School District","Superintendent","David Sawyer","100 Rathbun Willard Drive","","Attleboro","MA","02703","Alex Chiu","781-338-3586","alexandria.w.chiu@mass.gov",null,356,null,0,"Yes","1099",5840,null,0,991304,794513]
[23,"00170000","Auburn","Public School District","Superintendent","Maryellen Brunelle","5 West Street","","Auburn","MA","01501","Colleen Holforty","781-338-3522","colleen.e.holforty@mass.gov",null,91,null,7,"Yes","480",2538,null,0,189681,156025]
[24,"00180000","Avon","Public School District","Superintendent","Christine Godino","1 Patrick Clark Drive","","Avon","MA","02322","Nancy Labrie","781-338-3536","nancy.h.labrie@mass.gov",null,24,null,12,"Yes","171",704,null,0,69923,57516]
[25,"06160000","Ayer Shirley School District","Public School District","Superintendent","Mary Malone","115 Washington Street","","Ayer","MA","01432","Russ Fleming","781-338-6259","russellw.fleming@mass.gov",null,64,null,0,"Yes","641",1629,null,0,616339,506980]
[26,"00200000","Barnstable","Public School District","Superintendent","Meg Mayo-Brown","P O Box 955","","Hyannis","MA","02601","Alex Chiu","781-338-3586","alexandria.w.chiu@mass.gov",null,502,null,79,"Yes","645",4946,null,0,944586,776984]
[27,"35020000","Baystate Academy Charter Public School (District)","Charter District","Charter School Leader","Timothy Sneed","2001 Roosevelt Avenue","","Springfield","MA","01104","Beth O'Connell","781-338-3132","elizabeth.a.o'connell@mass.gov",null,61,null,0,"Yes","476",463,null,0,433525,356603]
[28,"00230000","Bedford","Public School District","Superintendent","Jonathan Sills","97 McMahon Road","","Bedford","MA","01730","Julia Foodman","781-338-3577","julia.b.foodman@mass.gov",null,155,null,1,"Yes","266",2666,null,0,56538,46507]
[29,"00240000","Belchertown","Public School District","Superintendent","Brian Cameron","PO Box 841","","Belchertown","MA","01007","Beth O'Connell","781-338-3132","elizabeth.a.o'connell@mass.gov",null,22,null,11,"Yes","191",2206,null,0,97319,80051]
[30,"00250000","Bellingham","Public School District","Superintendent","Peter Marano","4 Mechanic Street","","Bellingham","MA","02019","Sue Mazzarella","781-338-3587","susan.mazzarella@mass.gov",null,46,null,74,"Yes","230",2065,null,0,183357,150823]
[31,"00260000","Belmont","Public School District","Superintendent","John Phelan","644 Pleasant Street","","Belmont","MA","02478","Alex Chiu","781-338-3586","alexandria.w.chiu@mass.gov",null,357,null,0,"Yes","133",4740,null,0,154971,127474]
[32,"04200000","Benjamin Banneker Charter Public (District)","Charter District","Charter School Leader","Sherley Bretous-Carre","21 Notre Dame Avenue","","Cambridge","MA","02140","Ellie Rounds-Bloom","781-338-3128","eleanor.rounds@mass.gov",null,20,null,0,"Yes","232",312,null,0,144477,118842]
[33,"04470000","Benjamin Franklin Classical Charter Public (District)","Charter District","Charter School Leader","Heather Zolnowski","500 Financial Park","","Franklin","MA","02038","Russ Fleming","781-338-6259","russellw.fleming@mass.gov",null,26,null,0,"Yes","56",708,null,0,20690,20000]
[34,"00270000","Berkley","Public School District","Superintendent","Thomas Lynch","21 North Main Street","","Berkley","MA","02779","Russ Fleming","781-338-6259","russellw.fleming@mass.gov",null,6,null,0,"Yes","123",859,null,0,87929,72327]
[35,"04140000","Berkshire Arts and Technology Charter Public (District)","Charter District","Charter School Leader","James White","1 Commercial Pl","PO Box 267","Adams","MA","01220","Russ Fleming","781-338-6259","russellw.fleming@mass.gov",null,3,null,0,"Yes","250",356,null,0,106945,87970]
[36,"06180000","Berkshire Hills","Public School District","Superintendent","Peter Dillon","50 Main Street","PO Box 617","Stockbridge","MA","01262","Alex Chiu","781-338-3586","alexandria.w.chiu@mass.gov",null,40,null,0,"Yes","349",1183,null,6692.2438000000002,191638,141570]
[37,"06200000","Berlin-Boylston","Public School District","Superintendent","Jeffrey Zanghi","215 Main Street","","Boylston","MA","01505","Beth O'Connell","781-338-3132","elizabeth.a.o'connell@mass.gov",null,9,null,0,"Yes","184",1017,null,0,43646,24380]
[38,"00300000","Beverly","Public School District","Superintendent","Suzanne Charochak","70 Balch St.","","Beverly","MA","01915","Nancy Labrie","781-338-3536","nancy.h.labrie@mass.gov",null,164,null,0,"Yes","669",4660,null,9941.9588000000003,675860,555939]
[39,"00310000","Billerica","Public School District","Superintendent","Timothy Piwowar","365 Boston Rd","","Billerica","MA","01821","Russ Fleming","781-338-6259","russellw.fleming@mass.gov",null,69,null,16,"Yes","590",4668,null,2883.7575999999999,428834,352744]
[40,"08050000","Blackstone Valley Regional Vocational Technical","Public School District","Superintendent","Michael Fitzpatrick","65 Pleasant Street","","Upton","MA","01568","Alex Chiu","781-338-3586","alexandria.w.chiu@mass.gov",null,2,null,0,"No","187",1216,null,0,38859,31964]
{"$rows_left_out":363}
{"sheet":"Dropdowns","index":2,"n_rows":4,"n_cols":1,"rows_kept":4,"cut":false,"hidden":true,"merged":[]}
["YesNo"]
["Select One"]
["Yes"]
["No"]

{"sheet":"DataLookupValues","index":3,"n_rows":27,"n_cols":6,"rows_kept":27,"cut":false,"hidden":true,"merged":[]}
["Workbook Information"]
[]
[]
[]
["District Information"]
["District value",1,null,null,"Liasons"]
["District Name:",{"$f":"VLOOKUP(valDistr,DataDistr,3,FALSE)","v":"OrgName"},"district code",{"$f":"LEFT(VLOOKUP(valDistr,DataDistr,2,FALSE),4)","v":"DIST"},"Name",{"$f":"VLOOKUP(valDistr,DataDistr,12,FALSE)","v":"Liaison's Name"}]
["Address1",{"$f":"VLOOKUP(valDistr,DataDistr,7,FALSE)","v":"ADDR 1"},null,null,"Phone",{"$f":"VLOOKUP(valDistr,DataDistr,13,FALSE)","v":"Liaison's Number"}]
["Address2",{"$f":"IF(VLOOKUP(valDistr,DataDistr,8,FALSE)=0,\"\",VLOOKUP(valDistr,DataDistr,8,FALSE))","v":"ADDR 2"},null,null,"Email",{"$f":"VLOOKUP(valDistr,DataDistr,14,FALSE)","v":"Liaison's Email"}]
["City, State, ZIP",{"$f":"VLOOKUP(valDistr,DataDistr,9,FALSE)&\", \"&VLOOKUP(valDistr,DataDistr,10,FALSE)&\" \"&VLOOKUP(valDistr,DataDistr,11,FALSE)","v":"City, State Zip"}]
["District Enrollment",{"$f":"VLOOKUP(valDistr,DataDistr,17,FALSE)","v":0},"EL Enrollment",{"$f":"VLOOKUP(valDistr,DataDistr,16,FALSE)","v":"March 2019 nElCOUNT_sum"}]
["Low Inc Methods TI"]
["SELECT ONE",null,"TitleI Status"]
["Oct Eco Dis",null,1]
["Oct Eco Dis x 1.6",null,2,"SW"]
["March Eco Dis",null,3,"TA"]
["March Eco Dis x 1.6",null,4,"NT"]
["Other ",null,5,"CL"]
[]
["Homeless Enrollment",{"$f":"VLOOKUP(valDistr,DataDistr,18,FALSE)","v":"HOMELESS, K-12"}]
["SLE Gaps",{"$f":"VLOOKUP(valDistr,DataDistr,19,FALSE)","v":"SLE Gaps?"}]
["FY20 district Enrollment",{"$f":"VLOOKUP(valDistr,DataDistr,21,FALSE)","v":"March2020Enrolled"}]
[]
["Total FY20 Title I Reservation for Private Schools",null,{"$f":"VLOOKUP(valDistr, DataDistr, 23, FALSE)","v":"Total T1FY20 ES Res"}]
["Total FY20 Title I Allocation to District (Adjusted)",null,{"$f":"VLOOKUP(valDistr, DataDistr, 24, FALSE)","v":"Total T1 Adjusted Alloc"}]
["Total FY20 Title I Low Income District Students Served",null,{"$f":"VLOOKUP(valDistr, DataDistr, 20, FALSE)","v":"FY20 T1 Distr LowInc"}]
["Total ESSER Allocation",null,{"$f":"VLOOKUP(valDistr, DataDistr, 25, FALSE)","v":"ESSER Fund Allocation"}]